compile error bind-9.7.2-P3 osx 10.5.8 ppc

donovan jeffrey j donovan at
Wed Feb 9 03:43:00 UTC 2011


i was able to update ssl to OpenSSL 1.0.0c 2 Dec 2010
when i try and recompile bind I get an error on make

Undefined symbols:
  "_RSA_generate_key_ex", referenced from:
      _opensslrsa_generate in libdns.a(opensslrsa_link.o)
  "_DSA_generate_parameters_ex", referenced from:
      _openssldsa_generate in libdns.a(openssldsa_link.o)
  "_DH_generate_parameters_ex", referenced from:
      _openssldh_generate in libdns.a(openssldh_link.o)
ld: symbol(s) not found
collect2: ld returned 1 exit status
make[2]: *** [named] Error 1
make[1]: *** [subdirs] Error 1
make: *** [subdirs] Error 1

More information about the bind-users mailing list