make install error on 9.9.3. Undefined symbols: _krb5_gss_register_acceptor_identity

James Brown jlbrown at
Wed May 29 03:09:10 UTC 2013

Have just tried to upgrade from 9.9.2 to 9.9.3. Configure and make went OK, but 'sudo make install' ends with:

/usr/libexec/gcc/i686-apple-darwin8/4.0.1/ld: Undefined symbols:
collect2: ld returned 1 exit status
make[2]: *** [named] Error 1
make[1]: *** [subdirs] Error 1
make: *** [subdirs] Error 1

System is running Mac OS X 10.4.11

Any suggestions?



-------------- next part --------------
A non-text attachment was scrubbed...
Name: smime.p7s
Type: application/x-pkcs7-signature
Size: 5122 bytes
Desc: not available
URL: <>

More information about the bind-users mailing list