error compiling INN 2.4.6

Javi Pardo dakota at dakotabcn.net
Mon May 18 22:26:11 UTC 2009


i have this comand line in configure
./configure --prefix=/injail/inn/  
--with-news-master=news at dakotabcn.net  --with-kerberos --with-perl  
--with-python --with-sasl



and no have errors, but make generate this errors
The first line indicate no suck


python.c:31:20: error: Python.h: No such file or directory
python.c:36: error: expected â=â, â,â, â;â, âasmâ or â__attribute__â 
before â*â token
python.c:37: error: expected â=â, â,â, â;â, âasmâ or â__attribute__â 
before â*â token
python.c:40: error: expected â=â, â,â, â;â, âasmâ or â__attribute__â 
before â*â token
python.c:41: error: expected â=â, â,â, â;â, âasmâ or â__attribute__â 
before â*â token
python.c:42: error: expected â=â, â,â, â;â, âasmâ or â__attribute__â 
before â*â token
python.c:43: error: expected â=â, â,â, â;â, âasmâ or â__attribute__â 
before â*â token
python.c:46: error: expected â=â, â,â, â;â, âasmâ or â__attribute__â 
before â*â token
python.c:47: error: expected â=â, â,â, â;â, âasmâ or â__attribute__â 
before â*â token
python.c:48: error: expected â=â, â,â, â;â, âasmâ or â__attribute__â 
before â*â token
python.c:49: error: expected â=â, â,â, â;â, âasmâ or â__attribute__â 
before â*â token
python.c:50: error: expected â=â, â,â, â;â, âasmâ or â__attribute__â 
before â*â token
python.c: In function âPYcontrolâ:
python.c:83: error: âPYFilterObjectâ undeclared (first use in this function)
python.c:83: error: (Each undeclared identifier is reported only once
python.c:83: error: for each function it appears in.)
python.c: In function âPYartfilterâ:
python.c:111: error: âPyObjectâ undeclared (first use in this function)
python.c:111: error: âresultâ undeclared (first use in this function)
python.c:113: error: âPYFilterObjectâ undeclared (first use in this 
function)
python.c:113: error: âart_methodâ undeclared (first use in this function)
python.c:121: error: âPYheaditemâ undeclared (first use in this function)
python.c:123: error: âPy_Noneâ undeclared (first use in this function)
python.c:124: error: âPYheadersâ undeclared (first use in this function)
python.c:124: error: âPYheadkeyâ undeclared (first use in this function)
python.c:133: error: âPYbodykeyâ undeclared (first use in this function)
python.c:137: error: âPYlineskeyâ undeclared (first use in this function)
python.c:142: warning: passing argument 2 of âstrlcpyâ makes pointer 
from integer without a cast
python.c: In function âPYmidfilterâ:
python.c:169: error: âPyObjectâ undeclared (first use in this function)
python.c:169: error: âresultâ undeclared (first use in this function)
python.c:171: error: âPYFilterObjectâ undeclared (first use in this 
function)
python.c:171: error: âmsgid_methodâ undeclared (first use in this function)
python.c:176: warning: passing argument 2 of âstrlcpyâ makes pointer 
from integer without a cast
python.c: In function âPYmodeâ:
python.c:196: error: âPyObjectâ undeclared (first use in this function)
python.c:196: error: âresultâ undeclared (first use in this function)
python.c:199: error: âPYFilterObjectâ undeclared (first use in this 
function)
python.c:199: error: âmode_methodâ undeclared (first use in this function)
python.c: At top level:
python.c:226: error: expected â=â, â,â, â;â, âasmâ or â__attribute__â 
before â*â token
python.c:229: error: expected identifier or â(â before â{â token
python.c:248: error: expected â=â, â,â, â;â, âasmâ or â__attribute__â 
before â*â token
python.c:251: error: expected identifier or â(â before â{â token
python.c:268: error: expected â=â, â,â, â;â, âasmâ or â__attribute__â 
before â*â token
python.c:271: error: expected identifier or â(â before â{â token
python.c:292: error: expected â=â, â,â, â;â, âasmâ or â__attribute__â 
before â*â token
python.c:295: error: expected identifier or â(â before â{â token
python.c:322: error: expected â=â, â,â, â;â, âasmâ or â__attribute__â 
before â*â token
python.c:325: error: expected identifier or â(â before â{â token
python.c:363: error: expected â=â, â,â, â;â, âasmâ or â__attribute__â 
before â*â token
python.c:366: error: expected identifier or â(â before â{â token
python.c:395: error: expected â=â, â,â, â;â, âasmâ or â__attribute__â 
before â*â token
python.c:398: error: expected identifier or â(â before â{â token
python.c:429: error: expected â=â, â,â, â;â, âasmâ or â__attribute__â 
before â*â token
python.c:432: error: expected identifier or â(â before â{â token
python.c:465: error: expected â=â, â,â, â;â, âasmâ or â__attribute__â 
before â*â token
python.c:468: error: expected identifier or â(â before â{â token
python.c:540: error: expected â=â, â,â, â;â, âasmâ or â__attribute__â 
before âINNPyMethodsâ
python.c: In function âPYcloseâ:
python.c:561: error: âPyObjectâ undeclared (first use in this function)
python.c:561: error: âresultâ undeclared (first use in this function)
python.c:563: error: âclose_methodâ undeclared (first use in this function)
python.c: In function âPYdefonemethodâ:
python.c:577: error: expected declaration specifiers before âPyObjectâ
python.c:580: error: invalid type argument of âunary *â
python.c:585: error: âPYFilterObjectâ undeclared (first use in this 
function)
python.c:587: error: invalid type argument of âunary *â
python.c:589: error: invalid type argument of âunary *â
python.c:592: error: invalid type argument of âunary *â
python.c:594: error: invalid type argument of âunary *â
python.c:596: error: invalid type argument of âunary *â
python.c:597: error: invalid type argument of âunary *â
python.c: In function âPYdefmethodsâ:
python.c:610: error: âmsgid_methodâ undeclared (first use in this function)
python.c:611: error: âart_methodâ undeclared (first use in this function)
python.c:612: error: âmode_methodâ undeclared (first use in this function)
python.c:613: error: âpre_reload_methodâ undeclared (first use in this 
function)
python.c:614: error: âclose_methodâ undeclared (first use in this function)
python.c: In function âPYreadfilterâ:
python.c:625: error: âPyObjectâ undeclared (first use in this function)
python.c:625: error: ânewmoduleâ undeclared (first use in this function)
python.c:626: error: âresultâ undeclared (first use in this function)
python.c:634: error: âpre_reload_methodâ undeclared (first use in this 
function)
python.c:649: error: âPYFilterModuleâ undeclared (first use in this 
function)
python.c:663: error: âPYFilterObjectâ undeclared (first use in this 
function)
python.c: In function âPYsetupâ:
python.c:701: error: âINNPyMethodsâ undeclared (first use in this function)
python.c:703: error: âPYFilterModuleâ undeclared (first use in this 
function)
python.c:707: error: âPYFilterObjectâ undeclared (first use in this 
function)
python.c:719: error: âPYheadersâ undeclared (first use in this function)
python.c:721: error: âPYheaditemâ undeclared (first use in this function)
python.c:721: error: âPyObjectâ undeclared (first use in this function)
python.c:721: error: expected expression before â)â token
python.c:722: error: âPYheadkeyâ undeclared (first use in this function)
python.c:722: error: expected expression before â)â token
python.c:727: error: âPYpathkeyâ undeclared (first use in this function)
python.c:728: error: âPYlineskeyâ undeclared (first use in this function)
python.c:729: error: âPYbodykeyâ undeclared (first use in this function)
make[1]: *** [python.o] Error 1
make[1]: Leaving directory `/instalaciones/inn-2.4.6/innd'
make: *** [all-innd] Error 2
root at dakota:/instalaciones/inn-2.4.6#

any idea ?

regards

-- 
Javi Pardo "Dakota"
dakota at dakotabcn.net
MSN: dakota.msn at dakotabcn.net
EA3GNR - ECB84JLX




More information about the inn-workers mailing list