Cron <eagle at hope> bin/inn-snapshot

Julien ÉLIE julien at trigofacile.com
Sun Nov 29 20:47:26 UTC 2009


> util/inndf..............FAILED 1
>
> Failed Set                 Fail/Total (%) Skip Stat  Failing Tests
> -------------------------- -------------- ---- ----  ------------------------
> util/inndf                    1/6     17%    0    0  1
>
> Failed 1/2844 tests, 99.96% okay, 89 tests skipped.
> Files=55,  Tests=2844,  7.88 seconds (0.35 usr + 1.58 sys = 1.93 CPU)
> make[1]: *** [test] Error 1
> make[1]: Leaving directory `/home/eagle/snapshot/inn/tests'
> make: *** [test] Error 1

The failing test is only testing "df -k" and "inndf .".
No change has been recently done as for inndf.

I do not understand what could have happened, especially when STABLE
shares the same code for inndf, and had properly been generated.

-- 
Julien ÉLIE

« Audentes fortunat iuvat. » (Virgile) 




More information about the inn-workers mailing list